{"text_format":"1","workbook":"xlsx","n_sheets":9,"sheets":["Sales Order","Pricing Table","Promo Codes","Inputs","Calcs","LOA","TOLL FREE-Resporg","Sheet1","IP Justification Form"],"not_rendered":{"charts":0,"images":6,"macros":1,"external_links":3,"defined_names":110,"comments":2,"pivot_tables":0},"unopened":[],"bounds":{"document_bytes":16777216,"sheet_cells":100000,"rows_first":2000,"rows_last":500,"rows_between":2000,"halvings":0,"cell_chars":16384,"cell_head_chars":4096},"cells_cut":0,"cells_raw":0,"read":"whole","date_system":"1900"}

{"sheet":"Sales Order","index":0,"n_rows":160,"n_cols":22,"rows_kept":160,"cut":false,"hidden":false,"merged":[[51,3,51,4],[52,3,52,4],[53,3,53,4],[39,3,39,4],[46,3,46,4],[41,3,41,4],[42,3,42,4],[43,3,43,4],[44,3,44,4],[45,3,45,4],[47,3,47,4],[48,3,48,4],[49,3,49,4],[50,3,50,4],[41,9,41,10],[51,9,51,10],[54,9,54,10],[54,1,54,4],[48,17,48,19],[53,6,53,7],[53,9,53,10],[69,1,69,10],[48,9,48,10],[49,9,49,10],[52,6,52,7],[50,9,50,10],[48,6,48,7],[49,6,49,7],[50,6,50,7],[42,9,42,10],[47,9,47,10],[41,6,41,7],[46,9,46,10],[51,6,51,7],[43,6,43,7],[42,6,42,7],[47,6,47,7],[43,9,43,10],[46,6,46,7],[62,6,62,8],[61,6,61,8],[95,7,95,10],[87,7,87,10],[93,7,93,10],[91,7,91,10],[89,7,89,10],[59,6,59,8],[44,9,44,10],[114,2,114,3],[115,9,115,10],[119,9,119,10],[119,2,119,3],[114,7,114,8],[110,9,110,10],[111,9,111,10],[118,9,118,10],[110,2,110,3],[112,7,112,8],[115,7,115,8],[112,9,112,10],[117,2,117,3],[113,7,113,8],[110,7,110,8],[113,9,113,10],[111,7,111,8],[55,6,55,10],[54,6,54,7],[44,6,44,7],[45,6,45,7],[109,2,109,3],[104,2,104,3],[157,9,157,10],[156,9,156,10],[120,2,120,3],[116,2,116,3],[107,2,107,3],[117,9,117,10],[114,9,114,10],[157,1,157,4],[156,1,156,4],[146,1,146,4],[126,2,126,4],[130,2,130,4],[125,2,125,4],[127,2,127,4],[154,1,154,4],[155,1,155,4],[151,1,151,4],[125,8,125,10],[111,2,111,3],[112,2,112,3],[115,2,115,3],[154,7,154,8],[147,9,147,10],[154,9,154,10],[57,15,58,15],[61,9,61,10],[90,2,90,3],[108,2,108,3],[66,3,66,4],[102,2,102,3],[97,2,97,3],[97,7,97,10],[93,2,93,3],[62,9,62,10],[85,7,85,10],[80,2,80,3],[81,2,81,3],[71,1,72,10],[59,9,59,10],[76,6,76,7],[65,6,65,8],[65,9,65,10],[85,2,85,3],[78,2,78,3],[87,2,87,3],[103,7,103,10],[107,9,107,10],[100,7,100,10],[7,8,7,10],[9,8,9,10],[8,8,8,10],[12,5,12,7],[11,2,11,4],[8,2,8,4],[12,8,12,10],[9,2,9,4],[12,2,12,4],[11,8,11,10],[7,2,7,4],[13,2,13,4],[13,8,13,10],[26,6,26,7],[28,6,28,7],[40,9,40,10],[17,2,17,4],[15,1,15,10],[25,6,25,7],[23,6,23,10],[16,6,16,7],[31,6,31,7],[30,6,30,7],[40,6,40,7],[32,3,32,4],[33,6,33,7],[32,6,32,7],[38,6,38,10],[40,3,40,4],[0,1,0,11],[5,8,5,10],[1,9,1,10],[1,2,1,5],[4,2,4,4],[4,8,4,10],[5,2,5,4],[3,1,3,10],[6,2,6,4],[6,8,6,10],[16,19,16,20],[16,2,16,4],[21,19,21,20],[20,2,20,4],[17,6,17,9],[29,15,34,15],[22,1,22,10],[17,19,17,20],[19,2,19,4],[17,16,17,18],[20,6,20,9],[29,6,29,7],[27,6,27,7],[18,2,18,4],[23,1,23,2],[16,8,16,9],[30,3,30,4],[31,3,31,4],[155,9,155,10],[151,7,151,10],[152,7,152,8],[130,8,130,10],[152,9,152,10],[153,9,153,10],[153,7,153,8],[148,9,148,10],[127,8,127,10],[128,8,128,10],[129,8,129,10],[121,9,121,10],[120,7,120,8],[121,7,121,8],[57,1,57,10],[126,8,126,10],[74,6,74,11],[66,1,66,2],[124,1,124,10],[120,9,120,10],[95,2,95,3],[105,2,105,3],[106,2,106,3],[70,1,70,10],[77,1,77,10],[91,2,91,3],[152,1,153,4],[121,2,121,3],[118,2,118,3],[103,2,103,3],[82,2,82,3],[65,1,65,2],[98,2,98,3],[65,3,65,4],[92,2,92,3],[79,2,79,3],[101,2,101,3],[88,2,88,3],[94,2,94,3],[89,2,89,3],[83,2,83,3],[99,2,99,3],[100,2,100,3],[86,2,86,3],[96,2,96,3],[129,2,129,4],[128,2,128,4],[113,2,113,3]]}
[null,"COMCAST BUSINESS CLASS HOSPITALITY SERVICE ORDER AGREEMENT  v.10.6.14"]
[null,"Account Name:","Americas Best Value Inn",null,null,null,null,null," ID#:"]
[]
[null,"CUSTOMER INFORMATION  (Service Location)"]
[null,"Address 1","1954 S church Street",null,null,null,null,"City","Murfreesboro",null,null,null,null,{"$f":"IF(I5=\"\",\"\",I5&\", \"&I6)","v":"Murfreesboro, Tennessee"}]
[null,"Address 2",null,null,null,null,null,"State","Tennessee"]
[null,"Primary Contact Name","Kenny Patel",null,null,null,null,"ZIP Code",37130]
[null,"Business Phone","615-896-6042",null,null,null,null,"County"]
[null,"Cell Phone",null,null,null,null,null,"Email Address","abvi654@gmail.com"]
[null,"Alt.Phone",null,null,null,null,null,"Primary Fax Number"]
[]
[null,"Technical Contact Name",null,null,null,null,null,"Technical Contact On-site?"]
[null,"Technical Contact Business Phone",null,null,null,"Technical Contact Email"]
[null,"Property Manager Contact Name",null,null,null," ",null,"Property Mgr Phone"]
[]
{"$rows_left_out":146}
{"sheet":"Pricing Table","index":1,"n_rows":141,"n_cols":70,"rows_kept":141,"cut":false,"hidden":true,"merged":[[33,1,33,2],[35,1,35,2],[31,1,31,2],[137,1,137,6],[140,1,140,6],[40,1,40,6],[36,1,36,2],[37,1,37,2],[25,8,25,9],[27,8,27,9],[28,8,28,9],[29,8,29,9],[30,8,30,9],[29,1,29,2],[30,1,30,2],[21,1,21,2],[27,1,27,2],[28,1,28,2],[24,1,24,2],[24,8,24,9],[61,1,61,2],[3,1,3,5],[5,1,5,2],[6,1,6,2],[7,1,7,2],[8,1,8,2],[9,1,9,2],[10,1,10,2],[11,1,11,2],[12,1,12,2],[13,1,13,2],[22,1,22,2],[23,1,23,2],[19,1,19,5],[32,1,32,2],[30,15,30,16],[31,15,31,16],[32,15,32,16],[33,15,33,16],[33,8,33,9],[31,8,31,9],[32,8,32,9],[17,2,17,3],[19,15,19,19],[21,15,21,16],[22,15,22,16],[23,15,23,16],[19,8,19,12],[21,8,21,9],[22,8,22,9],[23,8,23,9],[24,15,24,16],[25,15,25,16],[27,15,27,16],[28,15,28,16],[29,15,29,16],[59,8,59,9],[35,15,35,16],[36,15,36,16],[37,15,37,16],[40,15,40,20],[56,8,56,9],[57,8,57,9],[55,8,55,9],[49,8,49,9],[35,8,35,9],[36,8,36,9],[37,8,37,9],[40,8,40,13]]}
[]
[]
[null,"Pricing Inputs",null,null,null,null,null,null,null,null,null,null,null,null,null,null,null,null,null,null,null,null,null,null,null,null,null,null,null,null,null,null,null,null,null,null,null,null,null,null,null,null,null,null,null,null,null,null,null,null,null,null,null,null,"Public View Pricing Table"]
[null,"Hospitality Video",null,null,null,null,null,null,null,null,null,null,null,null,null,null,null,null,null,null,null,null,null,null,null,null,null,null,null,null,null,null,null,null,null,null,null,null,null,null,null,null,null,null,null,null,null,null,null,null,null,null,null,null,"OUTLET CONFIGURATION",null,null,null,null,"SD Left","HD Left","Box Type","DTA Count",null,null,"OUTLET CALCS","1-8","9+"]
[null,"VIDEO SELECTIONS (In Room Only)",null,"Price #1","Price #2","Price #3","Price #4",null,null,null,null,null,null,null,null,null,null,null,null,null,null,null,null,"Price #5+","Price #5+","Price #5+","Price #5+","Price #5+","Price #5+","Price #5+","Price #5+","Price #5+","Price #5+","Price #5+","Price #5+","Price #5+","Price #5+","Price #5+","Price #5+","Price #5+","Price #5+","Price #5+","Price #5+","Price #5+","Price #5+","Price #5+","Price #5+","Price #5+","Price #5+","Price #5+","Price #5+","Price #5+",null,null,"OUTLET","Outlet Type","Included","Incl Type","Price",{"$f":"BO8","v":0},{"$f":"BO9","v":0},null,0,null,null,"Outlet plus equipment - SD",9.9499999999999993,5.95]
[null,"Digital Standard",null,8,null,null,null,null,null,null,null,null,null,null,null,null,null,null,null,null,null,null,null,9,{"$f":"+X6+1","v":10},{"$f":"+Y6+1","v":11},12,13,14,15,16,17,18,19,20,21,22,23,24,25,26,27,28,29,30,31,32,33,34,{"$f":"+AW6+1","v":35},36,37,null,null,1,{"$f":"IF($BI5>0,IF(AND($BF6=\"SD\",$BH5>0),\"SD\",\"HD\"),IF(BH5>0,\"SD\",\"\"))","v":""},{"$f":"BC6<=SUM($BP$8:$BP$9)","v":false},{"$f":"IF(BE6,IF($BP$8>0,$BN$8,IF($BP$9>0,$BN$9)),\"\")","v":""},{"$f":"IF(BF6=BD6,0,INDEX($BO$5:$BP$6,MATCH($BD6,$BN$8:$BN$9,0),IF(BC6>8,2,1)))","v":0},{"$f":"IF($BD6=\"SD\",SUM(BH5,-1),BH5)","v":0},{"$f":"IF($BD6=\"HD\",SUM(BI5,-1),BI5)","v":0},"",0,null,null,"Outlet plus equipment - HD ",12.95,8.9499999999999993]
[null,"HD Standard",null,7,9,11,null,null,null,null,null,null,null,null,null,null,null,null,null,null,null,null,null,null,null,null,null,null,null,null,null,null,null,null,null,null,null,null,null,null,null,null,null,null,null,null,null,null,null,null,null,null,null,null,2,"",{"$f":"BC7<=SUM($BP$8:$BP$9)","v":false},{"$f":"IF(BE7,IF($BP$8>0,$BN$8,IF($BP$9>0,$BN$9)),\"\")","v":""},{"$f":"IF(BF7=BD7,0,INDEX($BO$5:$BP$6,MATCH($BD7,$BN$8:$BN$9,0),IF(BC7>8,2,1)))","v":0},{"$f":"IF($BD7=\"SD\",SUM(BH6,-1),BH6)","v":0},{"$f":"IF($BD7=\"HD\",SUM(BI6,-1),BI6)","v":0},"",0,null,null,"Current Requests","Req","Incl","Charge"]
[null,"HBO",null,3.5,null,null,null,null,null,null,null,null,null,null,null,null,null,null,null,null,null,null,null,null,null,null,null,null,null,null,null,null,null,null,null,null,null,null,null,null,null,null,null,null,null,null,null,null,null,null,null,null,null,null,3,"",false,"",0,0,0,"",0,null,null,"SD",{"$f":"'Sales Order'!I54","v":0},{"$f":"SUMIF($BO$12:$BO$16,$BN8,$BR$12:$BR$16)","v":0},0]
[null,"Showtime",null,3.5,null,null,null,null,null,null,null,null,null,null,null,null,null,null,null,null,null,null,null,null,null,null,null,null,null,null,null,null,null,null,null,null,null,null,null,null,null,null,null,null,null,null,null,null,null,null,null,null,null,null,4,{"$f":"IF($BI8>0,IF(AND($BF9=\"SD\",$BH8>0),\"SD\",\"HD\"),IF(BH8>0,\"SD\",\"\"))","v":""},false,"",0,0,0,"",0,null,null,"HD",{"$f":"'Sales Order'!I55","v":0},{"$f":"SUMIF($BO$12:$BO$16,$BN9,$BR$12:$BR$16)","v":0},0]
[null,"VIDEO EQUIPMENT",null,null,null,null,null,null,null,null,null,null,null,null,null,null,null,null,null,null,null,null,null,null,null,null,null,null,null,null,null,null,null,null,null,null,null,null,null,null,null,null,null,null,null,null,null,null,null,null,null,null,null,null,5,{"$f":"IF($BI9>0,IF(AND($BF10=\"SD\",$BH9>0),\"SD\",\"HD\"),IF(BH9>0,\"SD\",\"\"))","v":""},false,"",0,0,0,"",0]
[null,"DTA ",null,0.55000000000000004,0.01,null,null,null,null,null,null,null,null,null,null,null,null,null,null,null,null,null,null,null,null,null,null,null,null,null,null,null,null,null,null,null,null,null,null,null,null,null,null,null,null,null,null,null,null,null,null,null,null,null,6,"",false,"",0,0,0,"",0,null,null,"INCLUDED OUTLETS","Type","Incl Count"]
[null,"DSTB ",null,2.2000000000000002,0.01,null,null,null,null,null,null,null,null,null,null,null,null,null,null,null,null,null,null,null,null,null,null,null,null,null,null,null,null,null,null,null,null,null,null,null,null,null,null,null,null,null,null,null,null,null,null,null,null,null,7,"",false,"",0,0,0,"",0,null,null,"Basic","SD",1,null,{"$f":"IFERROR(BN12=INDEX('Sales Order'!$G$41:$G$45,MATCH(\"X\",'Sales Order'!$I$41:$I$45,0)),FALSE)*BP12","v":0}]
[null,"HDSTB",null,2.2000000000000002,null,null,null,null,null,null,null,null,null,null,null,null,null,null,null,null,null,null,null,null,null,null,null,null,null,null,null,null,null,null,null,null,null,null,null,null,null,null,null,null,null,null,null,null,null,null,null,null,null,null,8,"",false,"",0,0,0,"",0,null,null,"Digital Variety","SD",1,null,{"$f":"IFERROR(BN13=INDEX('Sales Order'!$G$41:$G$45,MATCH(\"X\",'Sales Order'!$I$41:$I$45,0)),FALSE)*BP13","v":0}]
[null,"mini mDTA",null,75,null,null,null,null,null,null,null,null,null,null,null,null,null,null,null,null,null,null,null,null,null,null,null,null,null,null,null,null,null,null,null,null,null,null,null,null,null,null,null,null,null,null,null,null,null,null,null,null,null,null,9,"",false,"",0,0,0,null,0,null,null,"Digital Standard","SD",2,null,{"$f":"IFERROR(BN14=INDEX('Sales Order'!$G$41:$G$45,MATCH(\"X\",'Sales Order'!$I$41:$I$45,0)),FALSE)*BP14","v":0}]
[null,"mDTA",null,200,0.01,null,null,null,null,null,null,null,null,null,null,null,null,null,null,null,null,null,null,null,null,null,null,null,null,null,null,null,null,null,null,null,null,null,null,null,null,null,null,null,null,null,null,null,null,null,null,null,null,null,10,"",false,"",0,0,0,null,0,null,null,"Digital Deluxe","SD",2,null,{"$f":"IFERROR(BN15=INDEX('Sales Order'!$G$41:$G$45,MATCH(\"X\",'Sales Order'!$I$41:$I$45,0)),FALSE)*BP15","v":0}]
{"$rows_left_out":127}
{"sheet":"Promo Codes","index":2,"n_rows":54,"n_cols":2,"rows_kept":54,"cut":false,"hidden":true,"merged":[]}
["Promo Code","Promo Description"]
["HOSPITALITY","."]
["HOSP:HIStarter-$30","$30 MRC Discount off Hospitality Internet Starter (2 modem solution)($99.95) for discounted rate of $69.95. Purchase of Hospitality Free To Guest Video Required. MRC Discounts roll to rate card end of original term. Minimum 3 year term required, 5 year if HD FTG Video. 50 rooms or less locations. Taxes, Usage, Fees, Equip are Extra"]
["HOSP:HID75-$150","$150 MRC Discount off Hospitality Internet D75 ($399.95) for discounted rate of $249.95. Purchase of Hospitality Free To Guest Video Required. MRC Discounts roll to rate card end of original term. Minimum 3 year term required, 5 year if HD FTG Video. Taxes, Usage, Fees, Equip are Extra"]
["HOSP:HID100+-$150_3yr","$150 MRC Discount off Hospitality Internet D100+ ($499.95) for discounted rate of $349.95. Purchase of Hospitality Free To Guest Video Required. MRC Discounts roll to rate card end of original term. Minimum 3 year term required, 5 year if HD FTG Video. Taxes, Usage, Fees, Equip are Extra"]
["HOSP:HID50-$100_3yr","$100 MRC Discount off Hospitality Internet D50 ($299.95) for discounted rate of $199.95. Purchase of Hospitality Free To Guest Video Required. MRC Discounts roll to rate card end of original term. Minimum 3 year term required, 5 year if HD FTG Video. Taxes, Usage, Fees, Equip are Extra"]
["HOSP_$7FTGHD","$7 per room Hospitality FTG HD Video, a $4 MRC discount off rate card of $11 per room. Minimum Deluxe 50 Hospitality Internet or Ethernet Required. Minimum 65 room location required. 5 year term required. MRC Discount rolls to rate card at end of original term. Taxes, Usage, Equipment, Fees are extra"]
["HOSP_$7FTGHD_HID75-$150","$7 per room Hospitality FTG HD Video, a $4 MRC discount off rate card of $11 per room. $150 MRC Discount off Hospitality Internet Deluxe 75 ($399.95) for discounted rate of $249.95. Minimum 65 room location required. 5 year term required. MRC Discounts roll to rate card at end of original term. Taxes, Usage, Equipment, Fees are extra"]
["HOSP_$7FTGHD_HID100+-$150","$7 per room Hospitality FTG HD Video, a $4 MRC discount off rate card of $11 per room. $150 MRC Discount off Hospitality Internet Deluxe 100+ ($499.95) for discounted rate of $349.95. Minimum 65 room location required. 5 year term required. MRC Discounts roll to rate card at end of original term. Taxes, Usage, Equipment, Fees are extra"]
["HOSP_$7FTGHD_HID50-$100"," $7 per room Hospitality FTG HD Video, a $4 MRC discount off rate card of $11 per room. $100 MRC Discount off Hospitality Internet Deluxe 50 ($299.95) for discounted rate of $199.95. Minimum 65 room location required. 5 year term required. MRC Discounts roll to rate card at end of original term. Taxes, Usage, Equipment, Fees are extra"]
["HOSP_$9FTGHD","$9 per room Hospitality FTG HD Video, a $2 MRC discount off rate card of $11 per room. Minimum Deluxe 50 Hospitality Internet or Ethernet Required. Minimum 65 room location required. 5 year term required. MRC Discount rolls to rate card at end of original term. Taxes, Usage, Equipment, Fees are extra"]
["HOSP_$9FTGHD_HID75-$150","$9 per room Hospitality FTG HD Video, a $2 MRC discount off rate card of $11 per room. $150 MRC Discount off Hospitality Internet Deluxe 75 ($399.95) for discounted rate of $249.95. Minimum 65 room location required. 5 year term required. MRC Discounts roll to rate card at end of original term. Taxes, Usage, Equipment, Fees are extra"]
["HOSP_$9FTGHD_HID100+-$150","$9 per room Hospitality FTG HD Video, a $2 MRC discount off rate card of $11 per room. $150 MRC Discount off Hospitality Internet Deluxe 100+ ($499.95) for discounted rate of $349.95. Minimum 65 room location required. 5 year term required. MRC Discounts roll to rate card at end of original term. Taxes, Usage, Equipment, Fees are extra"]
["HOSP_$9FTGHD_HID50-$100","$9 per room Hospitality FTG HD Video, a $2 MRC discount off rate card of $11 per room. $100 MRC Discount off Hospitality Internet Deluxe 50 ($299.95) for discounted rate of $199.95. Minimum 65 room location required. 5 year term required. MRC Discounts roll to rate card at end of original term. Taxes, Usage, Equipment, Fees are extra"]
["#BCTPRI1FullBPHosp","1 Full Business Class Trunk PRI for $389, a $100 PRI MRC discount. Discount rolls to rate card at end of original term. For Hospitality locations only. Minimum 3 year term required. Taxes, Usage, Fees and equipment are extra."]
{"$rows_left_out":40}
{"sheet":"Inputs","index":3,"n_rows":23,"n_cols":8,"rows_kept":23,"cut":false,"hidden":false,"merged":[[23,1,25,3],[26,1,28,3],[3,2,3,3],[4,2,4,3]]}
[]
[null,"Construction Charge Inputs and Generator"]
[]
[null,"Account Name ….….…………………….....................",{"$f":"IF(+'Sales Order'!C2=\"\",\"\",+'Sales Order'!C2)","v":"Americas Best Value Inn"}]
[null,"Lead / Opportunity ID ….….………………………",{"$f":"IF(+'Sales Order'!J2=\"\",\"\",+'Sales Order'!J2)","v":""}]
[]
[null,"Total OSP/ISP Construction Capex ….….…"]
[null,"Total Fiber Construction Capex ………………………….………..",null,0]
[null,"Sales Channel …………………….…….….…"]
[null,"Lead / Opportunity ID ………………………………...…",null,{"$f":"IF(+'Sales Order'!J2=\"\",\"\",+'Sales Order'!J2)","v":""}]
[null,"Service Term  (Months)……………………………………………..………………………………………………..……",null,{"$f":"IF(+'Sales Order'!K18=\"\",\"Select Term on Sales Order\",'Sales Order'!K18)","v":36}]
[null,"Total Hospitality Service MRC …………………………….",null,{"$f":"+'Sales Order'!J66","v":1202.55},null,null,{"$f":"IF(+Calcs!B17=\"NA\",0,+Calcs!B17)","v":2.0301508726046844},{"$f":"IF(AND(0.25<G12,G12<0.35),1,IF(AND(0.15<G12,G12<0.25),2,IF(G12<0.15,3,0)))","v":0}]
[null,"Total Hospitality Service NRC ……………………….",null,{"$f":"+'Sales Order'!D66","v":179.7}]
[null,"Custom Installation Charge ………………………",null,{"$f":"+'Sales Order'!D67","v":"Charge May Apply"}]
[]
{"$rows_left_out":9}
{"sheet":"Calcs","index":4,"n_rows":245,"n_cols":69,"rows_kept":245,"cut":false,"hidden":true,"merged":[[45,0,45,1],[46,0,46,1],[47,0,47,1],[44,0,44,1],[33,3,33,5],[40,0,40,1],[41,0,41,1],[42,0,42,1],[43,0,43,1],[33,6,33,8],[35,0,35,1],[36,0,36,1],[37,0,37,1],[38,0,38,1],[48,0,48,1],[49,0,49,1],[50,0,50,1],[52,0,52,1],[53,0,53,1],[60,0,60,1],[54,0,54,1],[56,0,56,1],[57,0,57,1],[55,0,55,1],[59,0,59,1]]}
["Hospitality Services Financial Model"]
[{"$f":"IF(+'Sales Order'!C2=\"\",\"\", 'Sales Order'!C2)","v":"Americas Best Value Inn"}]
[{"$f":"+'Sales Order'!N5","v":"Murfreesboro, Tennessee"}]
["Opportunity Summary",null,null,"Financial  Summary","1-Yr","2-Yr","3-Yr","4-Yr","5-Yr"]
["# Rooms",{"$f":"+'Sales Order'!K21","v":115},null,"   GCV",{"$f":"SUM(D148:P148)","v":16313.020190482206},{"$f":"SUM(D148:AB148)","v":30743.620190482197},{"$f":"SUM($D$148:AN148)","v":45174.220190482229},{"$f":"SUM($D$148:AZ148)","v":59604.820190482264},{"$f":"SUM($D$148:BL148)","v":74035.420190482298}]
["Construction Capex",{"$f":"+Inputs!D7+Inputs!D8","v":0},null,"   IRR",{"$f":"+P163","v":1.5585943371289028},{"$f":"+AB163","v":1.9847798521266569},{"$f":"+AN163","v":2.0301508726046844},{"$f":"+AZ163","v":2.0365263191046132},{"$f":"+BL163","v":2.0374803219295563}]
["Equip & Labor Capex",{"$f":"+J109","v":5074},null,"   Break Even Month",{"$f":"+BL166","v":7},{"$f":"+BL166","v":7},{"$f":"+F7","v":7},{"$f":"+G7","v":7},7]
["     Total Capex",{"$f":"+B7+B6","v":5074},null,"   OCF Margin (3-Yr Avg)",{"$f":"+AN157","v":0.56045070891023252},{"$f":"+AN157","v":0.56045070891023252},{"$f":"+F8","v":0.56045070891023252},{"$f":"+G8","v":0.56045070891023252},{"$f":"+H8","v":0.56045070891023252}]
["Term (months)",{"$f":"+'Sales Order'!K18","v":36},null,"   Net FCF",{"$f":"+P162","v":4016.0601904822106},{"$f":"+AB162","v":12103.700190482208},{"$f":"+AN162","v":20191.340190482209},{"$f":"+AZ162","v":28278.980190482223},{"$f":"+BL162","v":36366.620190482237}]
["Total MRC",{"$f":"+E109","v":1202.55},null,"   Equity Multiple (FCF to Capex)",{"$f":"1+(+E9/$C$245)","v":1.2251912184861617},{"$f":"1+(+F9/$C$245)","v":1.6786867887452175},{"$f":"1+(+G9/$C$245)","v":2.1321823590042732},{"$f":"1+(+H9/$C$245)","v":2.5856779292633298},{"$f":"1+(+I9/$C$245)","v":3.0391734995223865}]
["Total NRC",{"$f":"+F109","v":174}]
["Custom Install Charge (NRC)",{"$f":"+'Sales Order'!D67","v":"Charge May Apply"},null,null,"Construction Charge Override: "]
["GCV",{"$f":"IF($B$9=12,E5,IF($B$9=24,F5,IF($B$9=36,G5,IF($B$9=48,H5,IF($B$9=60,I5,NA)))))","v":45174.220190482229}]
["HD Service",{"$f":"IF('Sales Order'!I27>0,\"Yes\",\"No\")","v":"Yes"},null,"Additional Services - Revenue and Cost Driver Sensitivity"]
["Premium Channel Svc",{"$f":"IF(('Sales Order'!I28+'Sales Order'!I29)>0,\"Yes\",\"No\")","v":"No"},null,"Incremental OSP/ISP Capex"]
{"$rows_left_out":231}
{"sheet":"LOA","index":5,"n_rows":54,"n_cols":8,"rows_kept":54,"cut":false,"hidden":false,"merged":[[55,1,55,8],[56,1,56,8],[40,1,40,8],[41,1,44,8],[45,1,45,8],[46,1,48,8],[49,1,49,8],[51,4,51,6],[36,2,36,4],[36,5,36,7],[37,2,37,4],[37,5,37,7],[38,2,38,4],[38,5,38,7],[33,2,33,4],[33,5,33,7],[34,2,34,4],[34,5,34,7],[35,2,35,4],[35,5,35,7],[30,2,30,4],[30,5,30,7],[31,2,31,4],[31,5,31,7],[32,2,32,4],[32,5,32,7],[27,2,27,4],[27,5,27,7],[28,2,28,4],[28,5,28,7],[29,2,29,4],[29,5,29,7],[24,2,24,4],[24,5,24,7],[25,2,25,4],[25,5,25,7],[26,2,26,4],[26,5,26,7],[23,2,23,4],[23,5,23,7],[5,1,5,8],[7,1,7,8],[9,3,9,8],[11,2,11,8],[12,2,12,4],[14,1,15,8],[16,1,18,8],[21,2,21,4],[21,5,21,7],[22,2,22,4],[22,5,22,7]]}
[]
[]
[]
[]
[]
[null,"Letter of Agency"]
[]
[null,"Please print or type the following information.  All blank spaces must be completed."]
[]
[null,"Billing Name (\"Company\"):"]
[null,null,null,null,"(As it appears on customers bill copy)"]
[null,"Billing Address: "]
[null,"City:",null,null,null,"State:",null,"Zip:"]
[]
[null,"If the company is switching its current phone number(s) to Comcast, please print the telephone number(s) and the name(s) of Company's current local phone service providers in the spaces below."]
{"$rows_left_out":40}
{"sheet":"TOLL FREE-Resporg","index":6,"n_rows":44,"n_cols":36,"rows_kept":44,"cut":false,"hidden":false,"merged":[[38,2,38,12],[40,2,40,3],[40,4,40,7],[40,9,40,11],[43,2,43,3],[43,4,43,7],[43,9,43,11],[33,3,33,5],[35,4,35,6],[35,8,35,11],[37,2,37,3],[37,4,37,6],[37,9,37,11],[27,3,27,6],[29,2,29,3],[29,4,29,8],[30,4,30,8],[31,2,31,3],[31,4,31,8],[26,3,26,6],[15,3,15,6],[16,3,16,6],[17,3,17,6],[18,3,18,6],[19,3,19,6],[20,3,20,6],[21,3,21,6],[22,3,22,6],[23,3,23,6],[24,3,24,6],[25,3,25,6],[14,3,14,6],[4,2,4,12],[5,2,5,3],[5,4,5,5],[6,2,6,12],[7,4,7,6],[7,10,7,11],[9,3,9,6],[10,3,10,6],[11,3,11,6],[12,3,12,6],[13,3,13,6]]}
[]
[]
[]
[]
[null,null,"Responsible Organization Letter of Authorization",null,null,null,null,null,null,null,null,null,null,null,null,null,null,null,null,null,null,null,null,null,null,null,null,null,null,null,null,null,null,null,"Resp Org"]
[null,null,"Toll Free Portability ",null,null,null,null,null,null,null,null,null,null,null,null,null,null,null,null,null,null,null,null,null,null,null,null,null,null,null,null,null,null,null,"Level 3 Communications, LLC (JSS01)  (“Level 3”)","JSS01"]
[null,null,"As the end-user subscriber, or the authorized representative of an end-user subscriber, of certain Toll Free service numbers (the “Customer”), I hereby authorize Comcast Phone, LLC to be the Responsible Organization(\"Resp Org\") for the following TollFree service numbers, including acting on my behalf, and at my direction, to transfer the Resp org function from"]
[null,null,"Current Carrier: ",null,null,null,null,"New Resp Org ID:",null,null,"JTN01"]
[]
[]
[]
[]
[]
[]
[]
{"$rows_left_out":30}
{"sheet":"Sheet1","index":7,"n_rows":0,"n_cols":0,"rows_kept":0,"cut":false,"hidden":true,"merged":[]}

{"sheet":"IP Justification Form","index":8,"n_rows":39,"n_cols":33,"rows_kept":39,"cut":false,"hidden":false,"merged":[[5,0,5,4],[5,5,5,13],[5,22,5,31],[0,0,0,32],[2,1,2,31],[4,0,4,4],[4,15,4,21],[4,22,4,31],[6,0,6,4],[6,5,6,13],[6,22,6,31],[7,0,7,4],[7,5,7,13],[7,22,7,31],[8,0,8,4],[8,5,8,13],[8,16,8,21],[8,22,8,31],[9,0,9,4],[9,5,9,13],[11,7,11,17],[14,13,14,32],[16,18,16,19],[16,21,18,32],[21,1,21,3],[21,4,21,10],[21,11,21,32],[22,1,22,3],[22,4,22,10],[22,11,22,32],[23,1,23,3],[23,4,23,10],[23,11,23,32],[24,1,24,3],[24,4,24,10],[24,11,24,32],[25,1,25,3],[25,4,25,10],[25,11,25,32],[26,1,26,3],[26,4,26,10],[26,11,26,32],[27,1,27,3],[27,4,27,10],[27,11,27,32],[28,1,28,3],[28,4,28,10],[28,11,28,32],[29,1,29,3],[29,4,29,10],[29,11,29,32],[30,1,30,3],[30,4,30,10],[30,11,30,32],[36,1,36,4],[36,5,36,16],[36,17,36,20],[36,21,36,32],[37,1,37,4],[37,5,37,16],[37,17,37,20],[37,21,37,32],[38,1,38,4],[38,5,38,16],[38,17,38,20],[38,21,38,32]]}
["                        IP Justification Form"]
[]
[]
[]
["Customer Site",null,null,null,null,null,null,null,null,null,null,null,null,null,null,"Technical Contact"]
["Location Name",null,null,null,null,null,null,null,null,null,null,null,null,null,1,null,null,null,null,null,null,"Name (Last, First)",null,null,null,null,null,null,null,null,null,null,"3a"]
["Street",null,null,null,null,null,null,null,null,null,null,null,null,null,"2a",null,null,null,null,null,null,"Title",null,null,null,null,null,null,null,null,null,null,"3b"]
["Rm/Ste/Fl",null,null,null,null,null,null,null,null,null,null,null,null,null,"2b",null,null,null,null,null,null,"Phone #",null,null,null,null,null,null,null,null,null,null,"3c"]
["City/St/Zip",null,null,null,null,null,null,null,null,null,null,null,null,null,"2c",null,"E-mail",null,null,null,null,null,null,null,null,null,null,null,null,null,null,null,"3d"]
["Phone #",null,null,null,null,null,null,null,null,null,null,null,null,null,"2d"]
[]
[null,"4.","Domain Name:",null,null,null,null,null,null,null,null,null,null,null,null,null,null,null,"Note: If more than one domain, use first domain registered."]
[]
[null,"5.","Do you have previously assigned addresses from Comcast?:"]
[null,null,"5d.","If yes, what addresses were assigned?:"]
{"$rows_left_out":24}